{"text_format":"3","workbook":"xlsx","n_sheets":3,"sheets":["Ficha","Indicadores","Plan2"],"not_rendered":{"charts":33,"images":2,"macros":1,"defined_names":1},"read":"whole","date_system":"1900"}

{"sheet":"Ficha","index":0,"n_rows":199,"n_cols":17,"rows_kept":199,"merged":[[1,0,4,17],[6,0,6,1],[6,2,6,17],[7,0,7,1],[7,2,7,17],[8,0,8,1],[8,2,8,17],[9,0,9,1],[9,2,9,17],[11,0,12,17],[13,0,14,0],[13,1,14,17],[15,1,16,17],[17,1,18,17],[19,1,20,17],[21,1,22,17],[23,1,23,17],[24,1,26,17],[28,0,28,13],[28,14,28,15],[28,16,28,17],[29,1,29,13],[29,14,29,15],[29,16,29,17],[30,1,30,13],[30,14,30,15],[30,16,30,17],[31,1,31,13],[31,14,31,15],[31,16,31,17],[32,0,32,13],[32,14,32,17],[35,0,35,13],[35,14,35,15],[35,16,35,17],[36,1,36,13],[36,14,36,15],[36,16,36,17],[37,1,37,13],[37,14,37,15],[37,16,37,17],[38,1,38,13],[38,14,38,15],[38,16,38,17],[39,0,39,13],[39,14,39,17],[42,0,42,13],[42,14,42,15],[42,16,42,17],[43,1,43,13],[43,14,43,15],[43,16,43,17],[44,0,44,13],[44,14,44,17],[47,0,47,13],[47,14,47,15],[47,16,47,17],[48,1,48,13],[48,14,48,15],[48,16,48,17],[49,1,49,13],[49,14,49,15],[49,16,49,17],[50,1,50,13],[50,14,50,15],[50,16,50,17],[51,1,51,13],[51,14,51,15],[51,16,51,17],[52,1,52,13],[52,14,52,15],[52,16,52,17],[53,1,53,13],[53,14,53,15],[53,16,53,17],[54,1,54,13],[54,14,54,15],[54,16,54,17],[55,0,55,13],[55,14,55,17],[58,0,58,13],[58,14,58,15],[58,16,58,17],[59,1,59,13],[59,14,59,15],[59,16,59,17],[60,1,60,13],[60,14,60,15],[60,16,60,17],[61,1,61,13],[61,14,61,15],[61,16,61,17],[62,0,62,13],[62,14,62,17],[65,0,65,13],[65,14,65,15],[65,16,65,17],[66,1,66,13],[66,14,66,15],[66,16,66,17],[67,1,67,13],[67,14,67,15],[67,16,67,17],[68,1,68,13],[68,14,68,15],[68,16,68,17],[69,0,69,13],[69,14,69,17],[72,0,72,13],[72,14,72,15],[72,16,72,17],[73,1,73,13],[73,14,73,15],[73,16,73,17],[74,1,74,13],[74,14,74,15],[74,16,74,17],[75,1,75,13],[75,14,75,15],[75,16,75,17],[76,1,76,13],[76,14,76,15],[76,16,76,17],[77,1,77,13],[77,14,77,15],[77,16,77,17],[78,1,78,13],[78,14,78,15],[78,16,78,17],[79,1,79,13],[79,14,79,15],[79,16,79,17],[80,1,80,13],[80,14,80,15],[80,16,80,17],[81,1,81,13],[81,14,81,15],[81,16,81,17],[82,0,82,13],[82,14,82,17],[85,0,85,13],[85,14,85,15],[85,16,85,17],[86,1,86,13],[86,14,86,15],[86,16,86,17],[87,1,87,13],[87,14,87,15],[87,16,87,17],[88,1,88,13],[88,14,88,15],[88,16,88,17],[89,1,89,13],[89,14,89,15],[89,16,89,17],[90,1,90,13],[90,14,90,15],[90,16,90,17],[91,1,91,13],[91,14,91,15],[91,16,91,17],[92,1,92,13],[92,14,92,15],[92,16,92,17],[93,1,93,13],[93,14,93,15],[93,16,93,17],[94,1,94,13],[94,14,94,15],[94,16,94,17],[95,1,95,13],[95,14,95,15],[95,16,95,17],[96,0,96,13],[96,14,96,17],[99,0,99,13],[99,14,99,15],[99,16,99,17],[100,1,100,13],[100,14,100,15],[100,16,100,17],[101,1,101,13],[101,14,101,15],[101,16,101,17],[102,1,102,13],[102,14,102,15],[102,16,102,17],[103,1,103,13],[103,14,103,15],[103,16,103,17],[104,1,104,13],[104,14,104,15],[104,16,104,17],[105,0,105,13],[105,14,105,17],[108,0,108,13],[108,14,108,15],[108,16,108,17],[109,1,109,13],[109,14,109,15],[109,16,109,17],[110,1,110,13],[110,14,110,15],[110,16,110,17],[111,1,111,13],[111,14,111,15],[111,16,111,17],[112,1,112,13],[112,14,112,15],[112,16,112,17],[113,1,113,13],[113,14,113,15],[113,16,113,17],[114,1,114,13],[114,14,114,15],[114,16,114,17],[115,1,115,13],[115,14,115,15],[115,16,115,17],[116,1,116,13],[116,14,116,15],[116,16,116,17],[117,1,117,13],[117,14,117,15],[117,16,117,17],[118,0,118,13],[118,14,118,17],[121,0,121,13],[121,14,121,15],[121,16,121,17],[122,1,122,13],[122,14,122,15],[122,16,122,17],[123,1,123,13],[123,14,123,15],[123,16,123,17],[124,1,124,13],[124,14,124,15],[124,16,124,17],[125,0,125,13],[125,14,125,17],[127,0,127,13],[127,14,127,15],[127,16,127,17],[128,1,128,13],[128,14,128,15],[128,16,128,17],[129,1,129,13],[129,14,129,15],[129,16,129,17],[130,1,130,13],[130,14,130,15],[130,16,130,17],[131,0,131,13],[131,14,131,17],[134,0,134,13],[134,14,134,15],[134,16,134,17],[135,1,135,13],[135,14,135,15],[135,16,135,17],[136,1,136,13],[136,14,136,15],[136,16,136,17],[137,1,137,13],[137,14,137,15],[137,16,137,17],[138,1,138,13],[138,14,138,15],[138,16,138,17],[139,1,139,13],[139,14,139,15],[139,16,139,17],[140,1,140,13],[140,14,140,15],[140,16,140,17],[141,0,141,13],[141,14,141,17],[144,0,144,13],[144,14,144,15],[144,16,144,17],[145,1,145,13],[145,14,145,15],[145,16,145,17],[146,1,146,13],[146,14,146,15],[146,16,146,17],[147,1,147,13],[147,14,147,15],[147,16,147,17],[148,1,148,13],[148,14,148,15],[148,16,148,17],[149,1,149,13],[149,14,149,15],[149,16,149,17],[150,0,150,13],[150,14,150,17],[153,0,153,13],[153,14,153,15],[153,16,153,17],[154,1,154,13],[154,14,154,15],[154,16,154,17],[155,1,155,13],[155,14,155,15],[155,16,155,17],[156,1,156,13],[156,14,156,15],[156,16,156,17],[157,1,157,13],[157,14,157,17],[159,0,159,16383],[160,0,160,17],[161,0,161,17],[162,0,162,17],[163,0,163,17],[164,0,164,17],[165,0,165,17],[166,0,166,17],[167,0,167,17],[168,0,168,11],[168,12,168,13],[168,14,168,15],[168,16,168,17],[169,0,169,11],[169,12,169,13],[169,14,169,15],[169,16,169,17],[170,0,170,11],[170,12,170,13],[170,14,170,15],[170,16,170,17],[171,0,171,11],[171,12,171,13],[171,14,171,15],[171,16,171,17],[172,0,172,11],[172,12,172,13],[172,14,172,15],[172,16,172,17],[173,0,173,11],[173,12,173,13],[173,14,173,15],[173,16,173,17],[174,0,174,11],[174,12,174,13],[174,14,174,15],[174,16,174,17],[175,0,175,11],[175,12,175,13],[175,14,175,15],[175,16,175,17],[176,0,176,11],[176,12,176,13],[176,14,176,15],[176,16,176,17],[177,0,177,11],[177,12,177,13],[177,14,177,15],[177,16,177,17],[178,0,178,11],[178,12,178,13],[178,14,178,15],[178,16,178,17],[179,0,179,11],[179,12,179,13],[179,14,179,15],[179,16,179,17],[180,0,180,11],[180,12,180,13],[180,14,180,15],[180,16,180,17],[181,0,181,11],[181,12,181,13],[181,14,181,15],[181,16,181,17],[182,0,182,11],[182,12,182,13],[182,14,182,15],[182,16,182,17],[183,0,183,11],[183,12,183,13],[183,14,183,15],[183,16,183,17],[184,0,184,11],[184,12,184,17],[185,0,185,11],[185,12,185,17],[186,0,186,11],[186,12,186,17],[187,0,187,11],[187,12,187,17],[190,8,192,17],[197,8,197,17],[198,8,199,17],[203,0,204,17],[207,0,209,17]]}
[]
["ANEXO III\n\nFICHA DE AVALIAÇÃO TÉCNICA DE OBM"]
[]
[]
[]
[]
["Comissão de Visita de Avaliação Técnica – CVAT"]
["Data da avaliação"]
["OBM visitada"]
["Cmt da OBM"]
[]
["INSTRUÇÕES PARA PREENCHIMENTO:"]
[]
["1.","Deverão ser preenchidos apenas os campos referentes a coluna \"Resultado\"."]
[]
["2.","Os campos da coluna \"Resultado\" encontram-se limitados, devendo ser preenchidos da seguinte maneira:"]
[]
[null,"a) inserir \"S\" (sem aspas) caso tenha cumprido os requisitos do item em sua totalidade, o que dará 1 ponto;"]
[]
[null,"b) inserir \"N\" (sem aspas) caso não tenha cumprido os requisitos do item, o que dará 0 ponto;"]
[]
[null,"c) caso tenha cumprido proporcionalmente o item, inserir porcentagem em múltiplos de 10, o que gerará pontuações que oscilarão entre 0,1 a 0,9 conforme o percentual inserido. Ex: 10%, 20%, 30%, etc."]
[]
["3.","O resultado final e os gráficos serão atualizados automaticamente."]
["4.","O resultado final será dado pela média aritmética entre a soma dos pontos e a quantidade de itens, respeitados os pesos atribuidos. Os conceitos obtidos serão: acima de 90% = \"Excelente\", entre 80% e 89,9% = \"Muito Bom\", entre 65% e 79,9% = \"Bom\", entre 50% e 64,9% = Regular, e abaixo de 50% = \"Insuficiente\". "]
[]
[]
[]
["I – Da Recepção: (Peso 1)",{"$nulls":13},"Resultado",null,"Pontos"]
["1.","O Comandante da OBM cumpriu o horário previsto para o início da avaliação técnica?",{"$nulls":14},{"$f":"IFERROR(VLOOKUP(O30,Plan2!A1:R11,2),\"\")","v":""}]
["2.","Quanto à apresentação pessoal, a tropa estava apresentável (fardamento, barba e corte de cabelo)? ",{"$nulls":14},{"$f":"IFERROR(VLOOKUP(O31,Plan2!A1:R11,2,0),\"\")","v":""}]
["3.","Com exceção dos militares em ocorrência e dos afastamentos legais, todo o efetivo disponível estava presente na formatura, conforme mapa força de efetivo?",{"$nulls":14},{"$f":"IFERROR(VLOOKUP(O32,Plan2!A1:R11,2,0),\"\")","v":""}]
["SUBTOTAL",{"$nulls":13},{"$f":"SUM(Q30:R32)","v":0}]
[]
[]
["II – Da exposição do Comandante da OBM e da percepção da tropa quanto ao Comando da OBM: (Peso 1)",{"$nulls":13},"Resultado",null,"Pontos"]
["4.","A exposição abordou os tópicos desta avaliação?",{"$nulls":14},{"$f":"IFERROR(VLOOKUP(O37,Plan2!A1:R11,2,0),\"\")","v":""}]
["5.","Foi apresentado Plano de Comando e o mesmo foi aprovado pelo Comando Geral e Comando Regional? (Anexo V)",{"$nulls":14},{"$f":"IFERROR(VLOOKUP(O38,Plan2!A1:R11,2,0),\"\")","v":""}]
["6.","Deverão ser escolhidos três militares da OBM para que o mesmo seja entrevistado pela comissão com o objetivo de se investigar qual a visão da tropa frente ao Comando da OBM.",{"$nulls":14},{"$f":"IFERROR(VLOOKUP(O39,Plan2!A1:R11,2,0),\"\")","v":""}]
["SUBTOTAL",{"$nulls":13},{"$f":"SUM(Q37:R39)","v":0}]
[]
[]
["III – Do Serviço de Dia: (Peso 1)",{"$nulls":13},"Resultado",null,"Pontos"]
["7.","A OBM realizou parada diária conforme Norma Operacional n. 07?",{"$nulls":14},{"$f":"IFERROR(VLOOKUP(O44,Plan2!A1:R11,2,0),\"\")","v":""}]
["SUBTOTAL",{"$nulls":13},{"$f":"SUM(Q44)","v":0}]
[]
[]
["IV – Da Demonstração Operacional: (Peso 2)",{"$nulls":13},"Resultado",null,"Pontos"]
["8.","A OBM realizou simulado de ocorrência operacional?",{"$nulls":14},{"$f":"IFERROR(VLOOKUP(O49,Plan2!A1:R11,2,0),\"\")","v":""}]
["9.","O local do simulado foi sinalizado adequadamente?",{"$nulls":14},{"$f":"IFERROR(VLOOKUP(O50,Plan2!$A$1:$R$11,2,0),\"\")","v":""}]
["10.","No simulado, os militares utilizaram EPI/EPR?",{"$nulls":14},{"$f":"IFERROR(VLOOKUP(O51,Plan2!$A$1:$R$11,2,0),\"\")","v":""}]
["11.","A guarnição de resgate de serviço no dia deverá executar uma atividade de resgate (retirada de vitima de veículo, retirada de capacete com rolamento 180º, ou qualquer outra atividade determinada pela comissão)",{"$nulls":14},{"$f":"IFERROR(VLOOKUP(O52,Plan2!$A$1:$R$11,2,0),\"\")","v":""}]
["12.","Escolher dois militares e determinar que os mesmos se equipem com com capa de aproximação, bota, capacete, balaclava e  EPR no tempo máximo de 2 minutos.",{"$nulls":14},{"$f":"IFERROR(VLOOKUP(O53,Plan2!$A$1:$R$11,2,0),\"\")","v":""}]
["13.","Escolher um militar e solicitar ao mesmo que este demonstre a utilização do desencarcerdor.",{"$nulls":14},{"$f":"IFERROR(VLOOKUP(O54,Plan2!$A$1:$R$11,2,0),\"\")","v":""}]
["14.","Escolher um militar e solicitar ao mesmo que este demonstre a utilização do EPR.",{"$nulls":14},{"$f":"IFERROR(VLOOKUP(O55,Plan2!$A$1:$R$11,2,0),\"\")","v":""}]
["SUBTOTAL",{"$nulls":13},{"$f":"SUM(Q49:R55)","v":0}]
[]
[]
["V – Do Condicionamento Físico: (Peso 2) ",{"$nulls":13},"Resultado",null,"Pontos"]
["15.","Nos Testes de Aptidão Física, com exceção dos dispensados por motivo de saúde, qual a porcentagem do efetivo se encontra, no mínimo, no conceito Muito Bom?",{"$nulls":14},{"$f":"IFERROR(VLOOKUP(O60,Plan2!A1:R11,2,0),\"\")","v":""}]
["16.","Apresentar a planilha do TAF da OBM e seu encaminhamento para publicação em BGE.",{"$nulls":14},{"$f":"IFERROR(VLOOKUP(O61,Plan2!$A$1:$R$11,2,0),\"\")","v":""}]
["17.","A OBM realizou a preparatória conforme Norma Administrativa n. 13?",{"$nulls":14},{"$f":"IFERROR(VLOOKUP(O62,Plan2!$A$1:$R$11,2,0),\"\")","v":""}]
["SUBTOTAL",{"$nulls":13},{"$f":"SUM(Q60:R62)","v":0}]
[]
[]
["VI – Da Instrução: Peso 2",{"$nulls":13},"Resultado",null,"Pontos"]
["18.","Existe QTS voltado ao serviço operacional prestado pela OBM, onde pelo menos uma vez por semana cada ala de serviço passa pela instrução progamada?",{"$nulls":14},{"$f":"IFERROR(VLOOKUP(O67,Plan2!A1:R11,2,0),\"\")","v":""}]
["19.","Existem registros das instruções ministradas?",{"$nulls":14},{"$f":"IFERROR(VLOOKUP(O68,Plan2!A1:R11,2,0),\"\")","v":""}]
["20.","A OBM aplica, anualmente, o Programa de Aperfeiçoamento Profissional - PAP?",{"$nulls":14},{"$f":"IFERROR(VLOOKUP(O69,Plan2!A1:R11,2,0),\"\")","v":""}]
["SUBTOTAL",{"$nulls":13},{"$f":"SUM(Q67:R69)","v":0}]
[]
[]
["VII – Do Controle de Pessoal e Financeiro: (Peso 1) ",{"$nulls":13},"Resultado",null,"Pontos"]
["21.","A OBM mantém arquivada, para fins de conhecimento e fiscalização, as escalas de serviço extraordinário?",{"$nulls":14},{"$f":"IFERROR(VLOOKUP(O74,Plan2!A1:R11,2,0),\"\")","v":""}]
["22.","As guias de viagem autorizadas pelo Comando Geral e/ou Regional (que geram diárias) são arquivadas e catalogadas em pasta própria, de forma a facilitar consultas e inspeções?",{"$nulls":14},{"$f":"IFERROR(VLOOKUP(O75,Plan2!A1:R11,2,0),\"\")","v":""}]
["23.","A OBM mantem arquivadas e catalogadas as matérias para BGE e BGR? (será aceito controle digital)",{"$nulls":14},{"$f":"IFERROR(VLOOKUP(O76,Plan2!A1:R11,2,0),\"\")","v":""}]
["24.","A Unidade verifica se as matérias enviadas para publicação foram contempladas, anotando o número do BG que as publicou?",{"$nulls":14},{"$f":"IFERROR(VLOOKUP(O77,Plan2!A1:R11,2,0),\"\")","v":""}]
["25.","Todo afastamento é publicado em Boletim Geral, exceto dispensa médica, feita pelo Órgão de Saúde da Corporação?",{"$nulls":14},{"$f":"IFERROR(VLOOKUP(O78,Plan2!A1:R11,2,0),\"\")","v":""}]
["26.","Os BM da OBM são orientados a realizar auditagem periódica nas fichas individuais?",{"$nulls":14},{"$f":"IFERROR(VLOOKUP(O79,Plan2!A1:R11,2,0),\"\")","v":""}]
["27.","Há controle dos BM à disposição da Junta Médica?",{"$nulls":14},{"$f":"IFERROR(VLOOKUP(O80,Plan2!A1:R11,2,0),\"\")","v":""}]
{"$rows_left_out":120}
{"sheet":"Indicadores","index":1,"n_rows":24,"n_cols":9,"rows_kept":24,"merged":[[0,0,0,7],[0,8,0,23],[1,0,1,7],[1,8,15,23],[2,0,2,7],[3,1,3,7],[4,1,4,7],[5,1,5,7],[6,1,6,7],[7,1,7,7],[8,0,8,7],[9,0,9,6],[10,0,10,6],[11,0,11,6],[12,0,12,6],[13,0,13,6],[14,0,14,6],[15,0,15,6],[16,0,16,6],[16,8,16,23],[17,0,17,6],[17,8,23,23],[18,0,18,6],[19,0,19,6],[20,0,20,6],[21,0,21,6],[22,0,22,6],[23,0,23,6]]}
["INDICADORES: RESUMO",{"$nulls":7},"INDICADORES DE DESEMPENHO"]
[]
["LEGENDA:"]
[null,"Excelente! (de 90% a 100%)"]
[85,"Muito Bom! (de 80% a 89,9%)"]
[75,"Bom! (de 65% a 79,9%)"]
[64,"Regular! (de 50% a 64,9%)"]
[49,"Insuficiente! (de 0% a 49,9%)"]
[]
["I – Da Recepção:",{"$nulls":6},{"$f":"Ficha!O33/3*100","v":{"v":0,"d":"0.00"}}]
["II – Da Exposição do Comandante da OBM:",{"$nulls":6},{"$f":"Ficha!O40/3*100","v":{"v":0,"d":"0.00"}}]
["III – Do Serviço de Dia:",{"$nulls":6},{"$f":"Ficha!O45*100","v":{"v":0,"d":"0.00"}}]
["IV – Da Demonstração Operacional:",{"$nulls":6},{"$f":"Ficha!O56/7*100","v":{"v":0,"d":"0.00"}}]
["V – Do Condicionamento Físico:",{"$nulls":6},{"$f":"Ficha!O63/3*100","v":{"v":0,"d":"0.00"}}]
["VI – Da Instrução:",{"$nulls":6},{"$f":"Ficha!O70/3*100","v":{"v":0,"d":"0.00"}}]
["VII – Do Controle de Pessoal e Financeiro:",{"$nulls":6},{"$f":"Ficha!O83/9*100","v":{"v":0,"d":"0.00"}}]
["VIII – Das Viaturas:",{"$nulls":6},{"$f":"Ficha!O97/10*100","v":{"v":0,"d":"0.00"}},"INDICADOR DE RESULTADO"]
["IX – Dos Equipamentos e Materiais Operacionais:",{"$nulls":6},{"$f":"Ficha!O106/5*100","v":{"v":0,"d":"0.00"}}]
["X – Das Instalações Físicas:",{"$nulls":6},{"$f":"Ficha!O119/9*100","v":{"v":0,"d":"0.00"}}]
["XI – Do Controle Patrimonial:",{"$nulls":6},{"$f":"Ficha!O126/3*100","v":{"v":0,"d":"0.00"}}]
["XII – Do Almoxarifado:",{"$nulls":6},{"$f":"Ficha!O132/3*100","v":{"v":0,"d":"0.00"}}]
["XIII – Do Registro e Controle Operacional:",{"$nulls":6},{"$f":"Ficha!O142/6*100","v":{"v":0,"d":"0.00"}}]
["XIV – Dos Sistemas de Informática e Telecomunicações:",{"$nulls":6},{"$f":"Ficha!O151/5*100","v":{"v":0,"d":"0.00"}}]
["XV – Dos Elementos Facilitadores:",{"$nulls":6},{"$f":"Ficha!O158/3*100","v":{"v":0,"d":"0.00"}}]

{"sheet":"Plan2","index":2,"n_rows":365,"n_cols":15,"rows_kept":365,"hidden":true}
["S",1,null,"Categoria","Máximo",{"$nulls":8},"S",0]
["N",0,null,"Insuficiente",{"v":0.499,"d":"50%"},{"$nulls":8},"N",1]
[{"v":0.1,"d":"10%"},0.1,null,"Regular",{"v":0.649,"d":"65%"},{"$nulls":8},{"v":0.1,"d":"10%"},0.9]
[{"v":0.2,"d":"20%"},0.2,null,"Bom",{"v":0.799,"d":"80%"},{"$nulls":8},{"v":0.2,"d":"20%"},0.8]
[{"v":0.3,"d":"30%"},0.3,null,"Muito Bom",{"v":0.899,"d":"90%"},{"$nulls":8},{"v":0.3,"d":"30%"},0.7]
[{"v":0.4,"d":"40%"},0.4,null,"Excelente",{"v":1,"d":"100%"},{"$nulls":8},{"v":0.4,"d":"40%"},0.6]
[{"v":0.5,"d":"50%"},0.5,null,"Observado (VOBS)",{"$f":"Ficha!$M$187","v":{"v":0,"d":"0%"}},{"$nulls":8},{"v":0.5,"d":"50%"},0.5]
[{"v":0.6,"d":"60%"},0.6,{"$nulls":11},{"v":0.6,"d":"60%"},0.4]
[{"v":0.7,"d":"70%"},0.7,null,"Mostrador","Amplitude",{"$nulls":8},{"v":0.7,"d":"70%"},0.3]
[{"v":0.8,"d":"80%"},0.8,null,"Oculto (ΣAMP)",{"v":1,"d":"100%"},{"$nulls":8},{"v":0.8,"d":"80%"},0.2]
[{"v":0.9,"d":"90%"},0.9,null,{"$f":" D2","v":"Insuficiente"},{"v":0.5,"d":"50%"},{"$nulls":8},{"v":0.9,"d":"90%"},0.1]
[{"$nulls":3},{"$f":" D3","v":"Regular"},{"v":0.15,"d":"15%"}]
[{"$f":"Ficha!M187","v":{"v":0,"d":"0%"}},null,null,{"$f":" D4","v":"Bom"},{"v":0.15,"d":"15%"}]
[{"$f":"Ficha!M188","v":""},null,null,"Muito Bom",{"v":0.1,"d":"10%"}]
[{"$nulls":3},"Excelente",{"v":0.1,"d":"10%"}]
[]
[{"$nulls":3},"Agulha"]
[{"$nulls":3},"Base","Extremidade"]
[{"$nulls":3},{"v":0,"d":"0.00"},{"v":0,"d":"0.00"}]
[{"$nulls":3},{"$f":"-COS(PI()*E7/E10)","v":{"v":-1,"d":"-1.00"}},{"$f":"SIN(PI()*E$7/E10)","v":{"v":0,"d":"0.00"}}]
[]
[]
[]
[{"$nulls":3},"Categoria","Máximo"]
[{"$nulls":3},"Insuficiente",{"v":0.499,"d":"50%"}]
[{"$f":"Ficha!O33","v":{"v":0,"d":"0.00"}},null,null,"Regular",{"v":0.649,"d":"65%"}]
[{"$f":"A26/3","v":0},null,null,"Bom",{"v":0.799,"d":"80%"}]
[{"$nulls":3},"Muito Bom",{"v":0.899,"d":"90%"}]
[{"$nulls":3},"Excelente",{"v":1,"d":"100%"}]
[{"$nulls":3},"Observado (VOBS)",{"$f":"A27","v":{"v":0,"d":"0.00%"}}]
[]
[{"$nulls":3},"Mostrador","Amplitude"]
[{"$nulls":3},"Oculto (ΣAMP)",{"v":1,"d":"100%"}]
[{"$nulls":3},{"$f":" D25","v":"Insuficiente"},{"v":0.5,"d":"50%"}]
[{"$nulls":3},{"$f":" D26","v":"Regular"},{"v":0.15,"d":"15%"}]
[{"$nulls":3},{"$f":" D27","v":"Bom"},{"v":0.15,"d":"15%"}]
[{"$nulls":3},"Muito Bom",{"v":0.1,"d":"10%"}]
[{"$nulls":3},"Excelente",{"v":0.1,"d":"10%"}]
[]
[{"$nulls":3},"Agulha"]
[{"$nulls":3},"Base","Extremidade"]
[{"$nulls":3},{"v":0,"d":"0.00"},{"v":0,"d":"0.00"}]
[{"$nulls":3},{"$f":"-COS(PI()*E30/E33)","v":{"v":-1,"d":"-1.00"}},{"$f":"SIN(PI()*E$30/E33)","v":{"v":0,"d":"0.00"}}]
[]
[]
[]
[{"$nulls":3},"Categoria","Máximo"]
[{"$nulls":3},"Insuficiente",{"v":0.499,"d":"50%"}]
[{"$f":"Ficha!O40","v":{"v":0,"d":"0.00"}},null,null,"Regular",{"v":0.649,"d":"65%"}]
[{"$f":"A49/3","v":0},null,null,"Bom",{"v":0.799,"d":"80%"}]
[{"$nulls":3},"Muito Bom",{"v":0.899,"d":"90%"}]
[{"$nulls":3},"Excelente",{"v":1,"d":"100%"}]
[{"$nulls":3},"Observado (VOBS)",{"$f":"A50","v":{"v":0,"d":"0%"}}]
[]
[{"$nulls":3},"Mostrador","Amplitude"]
[{"$nulls":3},"Oculto (ΣAMP)",{"v":1,"d":"100%"}]
[{"$nulls":3},{"$f":" D48","v":"Insuficiente"},{"v":0.5,"d":"50%"}]
[{"$nulls":3},{"$f":" D49","v":"Regular"},{"v":0.15,"d":"15%"}]
[{"$nulls":3},{"$f":" D50","v":"Bom"},{"v":0.15,"d":"15%"}]
[{"$nulls":3},"Muito Bom",{"v":0.1,"d":"10%"}]
[{"$nulls":3},"Excelente",{"v":0.1,"d":"10%"}]
[]
[{"$nulls":3},"Agulha"]
[{"$nulls":3},"Base","Extremidade"]
[{"$nulls":3},{"v":0,"d":"0.00"},{"v":0,"d":"0.00"}]
[{"$nulls":3},{"$f":"-COS(PI()*E53/E56)","v":{"v":-1,"d":"-1.00"}},{"$f":"SIN(PI()*E$53/E56)","v":{"v":0,"d":"0.00"}}]
[]
[]
[]
[{"$nulls":3},"Categoria","Máximo"]
[{"$nulls":3},"Insuficiente",{"v":0.499,"d":"50%"}]
[{"$f":"Ficha!O45","v":{"v":0,"d":"0.00"}},null,null,"Regular",{"v":0.649,"d":"65%"}]
[{"$f":"A72/1","v":0},null,null,"Bom",{"v":0.799,"d":"80%"}]
[{"$nulls":3},"Muito Bom",{"v":0.899,"d":"90%"}]
[{"$nulls":3},"Excelente",{"v":1,"d":"100%"}]
[{"$nulls":3},"Observado (VOBS)",{"$f":"A73","v":{"v":0,"d":"0%"}}]
[]
[{"$nulls":3},"Mostrador","Amplitude"]
[{"$nulls":3},"Oculto (ΣAMP)",{"v":1,"d":"100%"}]
[{"$nulls":3},{"$f":" D71","v":"Insuficiente"},{"v":0.5,"d":"50%"}]
{"$rows_left_out":285}